BDBM50327864 (1-Butylpiperidin-4-yl)methyl 4-Amino-3-(fluoromethoxy)-benzoate::CHEMBL1258672
SMILES CCCCN1CCC(COC(=O)c2ccc(N)c(OCF)c2)CC1
InChI Key InChIKey=BVDPGNIRFHUQHL-UHFFFAOYSA-N
Data  2 KI
  Tab Delimited (TSV)   2D SDfile   Computed 3D by Vconf -m prep SDfile
Find this compound or compounds like it in BindingDB:
Activity Spreadsheet -- Enzyme Inhibition Constant Data from BindingDB
Found 2 hits for monomerid = 50327864
Target5-hydroxytryptamine receptor 4(GUINEA PIG)
National Institute Of Mental Health
Curated by ChEMBL
LigandPNGBDBM50327864((1-Butylpiperidin-4-yl)methyl 4-Amino-3-(fluoromet...)
Affinity DataKi:  0.334nM. Assay description: Displacement of [3H]GR113808 from 5HT4 receptor in guinea pig striatal membranes
In DepthDetails ArticlePubMed
Target5-hydroxytryptamine receptor 4(Homo sapiens (Human))
National Institute Of Mental Health
Curated by ChEMBL
LigandPNGBDBM50327864((1-Butylpiperidin-4-yl)methyl 4-Amino-3-(fluoromet...)
Affinity DataKi:  17nM. Assay description: Displacement of [3H]GR113808 from human recombinant 5HT4 receptor expressed in HEK293 cells
In DepthDetails ArticlePubMed