BDBM50328099 2,2-Dimethyl-N-(2-morpholin-4-ylethyl)-5-pyrrolidin-1-yl-1,2,3,4-tetrahydropyrimido[4',5':4,5]thieno[2,3-c]isoquinolin-8-amine::CHEMBL1258470
SMILES CC1(C)CCc2c(C1)c1c(nc2N2CCCC2)sc2c(NCCN3CCOCC3)ncnc12
InChI Key InChIKey=XNIYDLUVCSJKFF-UHFFFAOYSA-N
Data  3 IC50
  Tab Delimited (TSV)   2D SDfile   Computed 3D by Vconf -m prep SDfile
Find this compound or compounds like it in BindingDB:
Activity Spreadsheet -- Enzyme Inhibition Constant Data from BindingDB
Found 3 hits for monomerid = 50328099
TargetcAMP-specific 3',5'-cyclic phosphodiesterase 4B(Homo sapiens (Human))
RhôNe-Poulenc Rorer
Curated by ChEMBL
LigandPNGBDBM50328099(2,2-Dimethyl-N-(2-morpholin-4-ylethyl)-5-pyrrolidi...)
Affinity DataIC50:  8.05nM. Assay description: Inhibition of PDE4B1 expressed in yeast
In DepthDetails ArticlePubMed
TargetcAMP-specific 3',5'-cyclic phosphodiesterase 4A(Homo sapiens (Human))
RhôNe-Poulenc Rorer
Curated by ChEMBL
LigandPNGBDBM50328099(2,2-Dimethyl-N-(2-morpholin-4-ylethyl)-5-pyrrolidi...)
Affinity DataIC50:  43nM. Assay description: Inhibition of PDE4A4 expressed in yeast
In DepthDetails ArticlePubMed
TargetcAMP-specific 3',5'-cyclic phosphodiesterase 4D(Homo sapiens (Human))
RhôNe-Poulenc Rorer
Curated by ChEMBL
LigandPNGBDBM50328099(2,2-Dimethyl-N-(2-morpholin-4-ylethyl)-5-pyrrolidi...)
Affinity DataIC50:  11nM. Assay description: Inhibition of PDE4D3 expressed in yeast
In DepthDetails ArticlePubMed