BDBM50328822 4-((3-hydroxypyridin-2-yl)diazenyl)benzenesulfonamide::CHEMBL1269954::NSC-134149
SMILES NS(=O)(=O)c1ccc(cc1)N=Nc1ncccc1O
InChI Key InChIKey=NXIPTBOTZGWDOZ-UHFFFAOYSA-N
Data  1 IC50
  Tab Delimited (TSV)   2D SDfile   Computed 3D by Vconf -m prep SDfile
Find this compound or compounds like it in BindingDB:
Activity Spreadsheet -- Enzyme Inhibition Constant Data from BindingDB
Found 1 hit for monomerid = 50328822
TargetPH domain leucine-rich repeat-containing protein phosphatase 2(Homo sapiens (Human))
University Of California San Diego
Curated by ChEMBL
LigandPNGBDBM50328822(4-((3-hydroxypyridin-2-yl)diazenyl)benzenesulfonam...)
Affinity DataIC50:  7.00E+3nM. Assay description: Inhibition of PHLPP2 phosphatase domain expressed in Escherichia coli
In DepthDetails ArticlePubMed