BDBM50328827 5-((E)-(4-((E)-(2,4-diamino-5-methyl-3-((E)-(4-methyl-2-sulfophenyl)diazenyl)phenyl)diazenyl)phenyl)diazenyl)-2-hydroxybenzoic acid::CHEMBL1269665::NSC-79714
SMILES Cc1ccc(N=Nc2c(N)c(C)cc(N=Nc3ccc(cc3)N=Nc3ccc(O)c(c3)C(O)=O)c2N)c(c1)S(O)(=O)=O
InChI Key InChIKey=YQRCCACEVOHSDF-UHFFFAOYSA-N
Data  1 IC50
  Tab Delimited (TSV)   2D SDfile   Computed 3D by Vconf -m prep SDfile
Find this compound or compounds like it in BindingDB:
Activity Spreadsheet -- Enzyme Inhibition Constant Data from BindingDB
Found 1 hit for monomerid = 50328827
TargetPH domain leucine-rich repeat-containing protein phosphatase 2(Homo sapiens (Human))
University Of California San Diego
Curated by ChEMBL
LigandPNGBDBM50328827(5-((E)-(4-((E)-(2,4-diamino-5-methyl-3-((E)-(4-met...)
Affinity DataIC50:  1.00E+4nM. Assay description: Inhibition of PHLPP2 phosphatase domain expressed in Escherichia coli
In DepthDetails ArticlePubMed