BDBM50328828 8-amino-5-((E)-(4'-((E)-(4-amino-6-(methylsulfonyl)naphthalen-1-yl)diazenyl)biphenyl-4-yl)diazenyl)naphthalene-2-sulfonic acid::CHEMBL1269018::NSC-45618
SMILES CS(=O)(=O)c1ccc2c(ccc(N)c2c1)\N=N\c1ccc(cc1)-c1ccc(cc1)\N=N\c1ccc(N)c2cc(ccc12)S(O)(=O)=O
InChI Key InChIKey=JHDYZZFDVVWMOD-NFSGFYSESA-N
Data  1 IC50
  Tab Delimited (TSV)   2D SDfile   Computed 3D by Vconf -m prep SDfile
Find this compound or compounds like it in BindingDB:
Activity Spreadsheet -- Enzyme Inhibition Constant Data from BindingDB
Found 1 hit for monomerid = 50328828
TargetPH domain leucine-rich repeat-containing protein phosphatase 2(Homo sapiens (Human))
University Of California San Diego
Curated by ChEMBL
LigandPNGBDBM50328828(8-amino-5-((E)-(4'-((E)-(4-amino-6-(methylsulfonyl...)
Affinity DataIC50:  1.50E+4nM. Assay description: Inhibition of PHLPP2 phosphatase domain expressed in Escherichia coli
In DepthDetails ArticlePubMed