BDBM50328838 2-hydroxy-5-((4-(N-thiazol-2-ylsulfamoyl)phenyl)diazenyl)benzoic acid::CHEMBL1270562::NSC-114428
SMILES OC(=O)c1cc(ccc1O)N=Nc1ccc(cc1)S(=O)(=O)Nc1nccs1
InChI Key InChIKey=FESOWBQMOCAPBN-UHFFFAOYSA-N
Data  1 IC50
  Tab Delimited (TSV)   2D SDfile   Computed 3D by Vconf -m prep SDfile
Find this compound or compounds like it in BindingDB:
Activity Spreadsheet -- Enzyme Inhibition Constant Data from BindingDB
Found 1 hit for monomerid = 50328838
TargetPH domain leucine-rich repeat-containing protein phosphatase 2(Homo sapiens (Human))
University Of California San Diego
Curated by ChEMBL
LigandPNGBDBM50328838(2-hydroxy-5-((4-(N-thiazol-2-ylsulfamoyl)phenyl)di...)
Affinity DataIC50:  4.90E+4nM. Assay description: Inhibition of PHLPP2 phosphatase domain expressed in Escherichia coli
In DepthDetails ArticlePubMed