BDBM50329508 10-Methoxy-9-(3-pyrrolidin-1-yl-propoxy)-5,6-dihydro-[1,3]dioxolo[4,5-g]isoquino[3,2-a]isoquinolin-7-ylium bromide::CHEMBL1269917
SMILES COc1ccc2cc3-c4cc5OCOc5cc4CC[n+]3cc2c1OCCCN1CCCC1
InChI Key InChIKey=RGYSVWJMQZUXQI-UHFFFAOYSA-N
Data  3 IC50
  Tab Delimited (TSV)   2D SDfile   Computed 3D by Vconf -m prep SDfile
Find this compound or compounds like it in BindingDB:
Activity Spreadsheet -- Enzyme Inhibition Constant Data from BindingDB
Found 3 hits for monomerid = 50329508
TargetCarboxylic ester hydrolase(Equus caballus (Horse))
Sun Yat-Sen University
Curated by ChEMBL
LigandPNGBDBM50329508(10-Methoxy-9-(3-pyrrolidin-1-yl-propoxy)-5,6-dihyd...)
Affinity DataIC50:  3.00E+3nM. Assay description: Inhibition of equine BChE after 15 mins by Ellman's method using acetylcholine as substrate
In DepthDetails ArticlePubMed
TargetCarboxylic ester hydrolase(Equus caballus (Horse))
Sun Yat-Sen University
Curated by ChEMBL
LigandPNGBDBM50329508(10-Methoxy-9-(3-pyrrolidin-1-yl-propoxy)-5,6-dihyd...)
Affinity DataIC50:  3.42E+3nM. Assay description: Inhibition of equine BChE after 15 mins by Ellman's method using butyrylcholine as substrate
In DepthDetails ArticlePubMed
TargetAcetylcholinesterase(Electrophorus electricus (Electric eel))
Sun Yat-Sen University
Curated by ChEMBL
LigandPNGBDBM50329508(10-Methoxy-9-(3-pyrrolidin-1-yl-propoxy)-5,6-dihyd...)
Affinity DataIC50:  93nM. Assay description: Inhibition of electric eel AChE after 15 mins by Ellman's method using acetylcholine as substrate
In DepthDetails ArticlePubMed