BDBM50329730 (S)-2-amino-6-chloro-N-(quinuclidin-3-yl)benzo[d]oxazole-4-carboxamide::CHEMBL1272232
SMILES Nc1nc2c(cc(Cl)cc2o1)C(=O)N[C@@H]1CN2CCC1CC2
InChI Key InChIKey=IATGNHOMUXVGCQ-LLVKDONJSA-N
Data  1 KI  1 IC50
  Tab Delimited (TSV)   2D SDfile   Computed 3D by Vconf -m prep SDfile
Find this compound or compounds like it in BindingDB:
Activity Spreadsheet -- Enzyme Inhibition Constant Data from BindingDB
Found 2 hits for monomerid = 50329730
Target5-hydroxytryptamine receptor 3A(Homo sapiens (Human))
Amri
Curated by ChEMBL
LigandPNGBDBM50329730((S)-2-amino-6-chloro-N-(quinuclidin-3-yl)benzo[d]o...)
Affinity DataKi:  4.70nM. Assay description: Binding affinity to human HT3A receptor
In DepthDetails ArticlePubMed
TargetPotassium voltage-gated channel subfamily H member 2(Homo sapiens (Human))
Amri
Curated by ChEMBL
LigandPNGBDBM50329730((S)-2-amino-6-chloro-N-(quinuclidin-3-yl)benzo[d]o...)
Affinity DataIC50:  4.80E+3nM. Assay description: Inhibition of human ERG expressed in HEK cells by patch clamp technique
In DepthDetails ArticlePubMed