BDBM50329751 CHEMBL1271904::endo-N-((1R,5R)-9-methyl-9-azabicyclo[3.3.1]nonan-3-yl)-2-((S)-2-methylpiperazin-1-yl)benzo[d]oxazole-4-carboxamide
SMILES C[C@H]1CNCCN1c1nc2c(cccc2o1)C(=O)NC1C[C@H]2CCC[C@H](C1)N2C
InChI Key InChIKey=QWZXRDUZUQKTLV-USXIJHARSA-N
Data  1 KI
  Tab Delimited (TSV)   2D SDfile   Computed 3D by Vconf -m prep SDfile
Find this compound or compounds like it in BindingDB:
Activity Spreadsheet -- Enzyme Inhibition Constant Data from BindingDB
Found 1 hit for monomerid = 50329751
Target5-hydroxytryptamine receptor 3A(Homo sapiens (Human))
Amri
Curated by ChEMBL
LigandPNGBDBM50329751(CHEMBL1271904 | endo-N-((1R,5R)-9-methyl-9-azabicy...)
Affinity DataKi:  16.5nM. Assay description: Binding affinity to human HT3A receptor
In DepthDetails ArticlePubMed