BDBM50329754 (S)-2-(diethylamino)-N-(quinuclidin-3-yl)benzo[d]oxazole-4-carboxamide::CHEMBL1272122
SMILES CCN(CC)c1nc2c(cccc2o1)C(=O)N[C@@H]1CN2CCC1CC2
InChI Key InChIKey=ZCUBEQCDRQOEAQ-OAHLLOKOSA-N
Data  1 KI
  Tab Delimited (TSV)   2D SDfile   Computed 3D by Vconf -m prep SDfile
Find this compound or compounds like it in BindingDB:
Activity Spreadsheet -- Enzyme Inhibition Constant Data from BindingDB
Found 1 hit for monomerid = 50329754
Target5-hydroxytryptamine receptor 3A(Homo sapiens (Human))
Amri
Curated by ChEMBL
LigandPNGBDBM50329754((S)-2-(diethylamino)-N-(quinuclidin-3-yl)benzo[d]o...)
Affinity DataKi:  12.4nM. Assay description: Binding affinity to human HT3A receptor
In DepthDetails ArticlePubMed