BDBM50329932 1-methyl-8-(2-(trifluoromethoxy)phenylamino)-4,5-dihydro-1H-pyrazolo[4,3-h]quinazoline-3-carboxamide::CHEMBL1272089
SMILES Cn1nc(C(N)=O)c2CCc3cnc(Nc4ccccc4OC(F)(F)F)nc3-c12
InChI Key InChIKey=GCFCQBCBKXQUCD-UHFFFAOYSA-N
Data  8 IC50
  Tab Delimited (TSV)   2D SDfile   Computed 3D by Vconf -m prep SDfile
Find this compound or compounds like it in BindingDB:
Activity Spreadsheet -- Enzyme Inhibition Constant Data from BindingDB
Found 4 hits for monomerid = 50329932
TargetDual specificity protein kinase TTK(Homo sapiens (Human))
Nerviano Medical Sciences
Curated by ChEMBL
LigandPNGBDBM50329932(1-methyl-8-(2-(trifluoromethoxy)phenylamino)-4,5-d...)
Affinity DataIC50:  1.22E+3nM. Assay description: Inhibition of MPS1 assessed as [33P]-gamma-ATP incorporation into substrate P38-betatide by gamma counting
In DepthDetails ArticlePubMed
TargetSerine/threonine-protein kinase PLK1(Homo sapiens (Human))
Nerviano Medical Sciences
Curated by ChEMBL
LigandPNGBDBM50329932(1-methyl-8-(2-(trifluoromethoxy)phenylamino)-4,5-d...)
Affinity DataIC50:  117nM. Assay description: Inhibition of PLK1 assessed as [33P]-gamma-ATP incorporation into substrate by gamma counting
In DepthDetails ArticlePubMed
TargetAurora kinase A(Homo sapiens (Human))
Nerviano Medical Sciences
Curated by ChEMBL
LigandPNGBDBM50329932(1-methyl-8-(2-(trifluoromethoxy)phenylamino)-4,5-d...)
Affinity DataIC50: >1.00E+4nM. Assay description: Inhibition of Aur-A assessed as [33P]-gamma-ATP incorporation into substrate by gamma counting
In DepthDetails ArticlePubMed
TargetCyclin-A2/Cyclin-dependent kinase 2(Homo sapiens (Human))
Nerviano Medical Sciences
Curated by ChEMBL
LigandPNGBDBM50329932(1-methyl-8-(2-(trifluoromethoxy)phenylamino)-4,5-d...)
Affinity DataIC50: >1.00E+4nM. Assay description: Inhibition of CDK2/Cyclin A assessed as [33P]-gamma-ATP incorporation into substrate by gamma counting
In DepthDetails ArticlePubMed