BDBM50330264 CHEMBL1271511::[5-Bromo-4-(3-isopropyl-1H-pyrazol-4-yl)-pyrimidin-2-yl]-(1-methyl-piperidin-4-yl)-amine
SMILES CC(C)c1[nH]ncc1-c1nc(NC2CCN(C)CC2)ncc1Br
InChI Key InChIKey=UNGSBCKKKYIIJC-UHFFFAOYSA-N
Data  4 IC50
  Tab Delimited (TSV)   2D SDfile   Computed 3D by Vconf -m prep SDfile
Find this compound or compounds like it in BindingDB:
Activity Spreadsheet -- Enzyme Inhibition Constant Data from BindingDB
Found 4 hits for monomerid = 50330264
TargetCyclin-A1/Cyclin-A2/Cyclin-dependent kinase 2(Homo sapiens (Human))
Novartis Institutes For Biomedical Research
Curated by ChEMBL
LigandPNGBDBM50330264(CHEMBL1271511 | [5-Bromo-4-(3-isopropyl-1H-pyrazol...)
Affinity DataIC50:  1.97E+3nM. Assay description: Inhibition of human CDK2/cyclin A after 2 hrs by IMAP-FP assay
In DepthDetails ArticlePubMed
TargetCyclin-dependent kinase/G2/mitotic-specific cyclin- 1(Homo sapiens (Human))
Novartis Institutes For Biomedical Research
Curated by ChEMBL
LigandPNGBDBM50330264(CHEMBL1271511 | [5-Bromo-4-(3-isopropyl-1H-pyrazol...)
Affinity DataIC50:  2.51E+3nM. Assay description: Inhibition of human CDK1/cyclin B after 2 hrs by IMAP-FP assay
In DepthDetails ArticlePubMed
TargetCyclin-dependent kinase 4/G1/S-specific cyclin-D1(Homo sapiens (Human))
Novartis Institutes For Biomedical Research
Curated by ChEMBL
LigandPNGBDBM50330264(CHEMBL1271511 | [5-Bromo-4-(3-isopropyl-1H-pyrazol...)
Affinity DataIC50:  540nM. Assay description: Inhibition of human CDK4/cyclin D1 expressed in baculovirus infected Sf21 cells after 60 mins by TR-FRET assay
In DepthDetails ArticlePubMed
TargetCyclin-dependent kinase 6/G1/S-specific cyclin-D3(Homo sapiens (Human))
Novartis Institutes For Biomedical Research
Curated by ChEMBL
LigandPNGBDBM50330264(CHEMBL1271511 | [5-Bromo-4-(3-isopropyl-1H-pyrazol...)
Affinity DataIC50:  737nM. Assay description: Inhibition of human CDK6/cyclin D3 after 2 hrs by TR-FRET assay
In DepthDetails ArticlePubMed