BDBM50330278 CHEMBL1271784::[4-(5-Isopropyl-3-methyl-1H-pyrazol-4-yl)-pyrimidin-2-yl]-(5-piperazin-1-yl-pyridin-2-yl)-amine
SMILES CC(C)c1n[nH]c(C)c1-c1ccnc(Nc2ccc(cn2)N2CCNCC2)n1
InChI Key InChIKey=CHCNFXZXNLWZAK-UHFFFAOYSA-N
Data  3 IC50
  Tab Delimited (TSV)   2D SDfile   Computed 3D by Vconf -m prep SDfile
Find this compound or compounds like it in BindingDB:
Activity Spreadsheet -- Enzyme Inhibition Constant Data from BindingDB
Found 3 hits for monomerid = 50330278
TargetCyclin-A1/Cyclin-A2/Cyclin-dependent kinase 2(Homo sapiens (Human))
Novartis Institutes For Biomedical Research
Curated by ChEMBL
LigandPNGBDBM50330278(CHEMBL1271784 | [4-(5-Isopropyl-3-methyl-1H-pyrazo...)
Affinity DataIC50: >1.50E+4nM. Assay description: Inhibition of human CDK2/cyclin A after 2 hrs by IMAP-FP assay
In DepthDetails ArticlePubMed
TargetCyclin-dependent kinase/G2/mitotic-specific cyclin- 1(Homo sapiens (Human))
Novartis Institutes For Biomedical Research
Curated by ChEMBL
LigandPNGBDBM50330278(CHEMBL1271784 | [4-(5-Isopropyl-3-methyl-1H-pyrazo...)
Affinity DataIC50: >1.50E+4nM. Assay description: Inhibition of human CDK1/cyclin B after 2 hrs by IMAP-FP assay
In DepthDetails ArticlePubMed
TargetCyclin-dependent kinase 4/G1/S-specific cyclin-D1(Homo sapiens (Human))
Novartis Institutes For Biomedical Research
Curated by ChEMBL
LigandPNGBDBM50330278(CHEMBL1271784 | [4-(5-Isopropyl-3-methyl-1H-pyrazo...)
Affinity DataIC50:  274nM. Assay description: Inhibition of human CDK4/cyclin D1 expressed in baculovirus infected Sf21 cells after 60 mins by TR-FRET assay
In DepthDetails ArticlePubMed