BDBM50333047 1-{3-[2-(4-Acetyl-piperazin-1-yl)-ethoxy]-phenyl}-3-adamantan-1-yl-urea::CHEMBL1632478
SMILES CC(=O)N1CCN(CCOc2cccc(NC(=O)NC34CC5CC(CC(C5)C3)C4)c2)CC1
InChI Key InChIKey=BQWJKSUUGMQCIO-UHFFFAOYSA-N
Data  1 IC50
  Tab Delimited (TSV)   2D SDfile   Computed 3D by Vconf -m prep SDfile
Find this compound or compounds like it in BindingDB:
Activity Spreadsheet -- Enzyme Inhibition Constant Data from BindingDB
Found 1 hit for monomerid = 50333047
TargetBifunctional epoxide hydrolase 2(Homo sapiens (Human))
TBA
Curated by ChEMBL
LigandPNGBDBM50333047(1-{3-[2-(4-Acetyl-piperazin-1-yl)-ethoxy]-phenyl}-...)
Affinity DataIC50:  6nM. Assay description: Inhibition of human recombinant soluble epoxide hydrolase expressed in baculovirus expression system by fluorimetric assay
In DepthDetails ArticlePubMed