BDBM50333068 1-Adamantan-1-yl-3-[4-(3-piperazin-1-yl-propoxy)-phenyl]-urea::CHEMBL1632458
SMILES O=C(Nc1ccc(OCCCN2CCNCC2)cc1)NC12CC3CC(CC(C3)C1)C2
InChI Key InChIKey=CANBDBWGVROSBI-UHFFFAOYSA-N
Data  1 IC50
  Tab Delimited (TSV)   2D SDfile   Computed 3D by Vconf -m prep SDfile
Find this compound or compounds like it in BindingDB:
Activity Spreadsheet -- Enzyme Inhibition Constant Data from BindingDB
Found 1 hit for monomerid = 50333068
TargetBifunctional epoxide hydrolase 2(Homo sapiens (Human))
TBA
Curated by ChEMBL
LigandPNGBDBM50333068(1-Adamantan-1-yl-3-[4-(3-piperazin-1-yl-propoxy)-p...)
Affinity DataIC50:  156nM. Assay description: Inhibition of human recombinant soluble epoxide hydrolase expressed in baculovirus expression system by fluorimetric assay
In DepthDetails ArticlePubMed