BDBM50333070 1-Adamantan-1-yl-3-{3-[3-(4-methyl-piperazin-1-yl)-propoxy]-phenyl}-urea::CHEMBL1632442
SMILES CN1CCN(CCCOc2cccc(NC(=O)NC34CC5CC(CC(C5)C3)C4)c2)CC1
InChI Key InChIKey=YGTSSIFMDDURBD-UHFFFAOYSA-N
Data  1 IC50
  Tab Delimited (TSV)   2D SDfile   Computed 3D by Vconf -m prep SDfile
Find this compound or compounds like it in BindingDB:
Activity Spreadsheet -- Enzyme Inhibition Constant Data from BindingDB
Found 1 hit for monomerid = 50333070
TargetBifunctional epoxide hydrolase 2(Homo sapiens (Human))
TBA
Curated by ChEMBL
LigandPNGBDBM50333070(1-Adamantan-1-yl-3-{3-[3-(4-methyl-piperazin-1-yl)...)
Affinity DataIC50:  23.1nM. Assay description: Inhibition of human recombinant soluble epoxide hydrolase expressed in baculovirus expression system by fluorimetric assay
In DepthDetails ArticlePubMed