BDBM50333073 1-Adamantan-1-yl-3-(2-(3-(4-methylpiperazin-1-yl)propoxy)-phenyl)urea::CHEMBL1632454
SMILES CN1CCN(CCCOc2ccccc2NC(=O)NC23CC4CC(CC(C4)C2)C3)CC1
InChI Key InChIKey=RDJXLMVDPTVJNE-UHFFFAOYSA-N
Data  1 IC50
  Tab Delimited (TSV)   2D SDfile   Computed 3D by Vconf -m prep SDfile
Find this compound or compounds like it in BindingDB:
Activity Spreadsheet -- Enzyme Inhibition Constant Data from BindingDB
Found 1 hit for monomerid = 50333073
TargetBifunctional epoxide hydrolase 2(Homo sapiens (Human))
TBA
Curated by ChEMBL
LigandPNGBDBM50333073(1-Adamantan-1-yl-3-(2-(3-(4-methylpiperazin-1-yl)p...)
Affinity DataIC50:  2.88E+3nM. Assay description: Inhibition of human recombinant soluble epoxide hydrolase expressed in baculovirus expression system by fluorimetric assay
In DepthDetails ArticlePubMed