BDBM50333075 1-Adamantan-1-yl-3-{4-[4-(4-methyl-piperazin-1-yl)-butoxy]-phenyl}-urea::CHEMBL1632467
SMILES CN1CCN(CCCCOc2ccc(NC(=O)NC34CC5CC(CC(C5)C3)C4)cc2)CC1
InChI Key InChIKey=INODXWLZQOPUDX-UHFFFAOYSA-N
Data  1 IC50
  Tab Delimited (TSV)   2D SDfile   Computed 3D by Vconf -m prep SDfile
Find this compound or compounds like it in BindingDB:
Activity Spreadsheet -- Enzyme Inhibition Constant Data from BindingDB
Found 1 hit for monomerid = 50333075
TargetBifunctional epoxide hydrolase 2(Homo sapiens (Human))
TBA
Curated by ChEMBL
LigandPNGBDBM50333075(1-Adamantan-1-yl-3-{4-[4-(4-methyl-piperazin-1-yl)...)
Affinity DataIC50:  44.8nM. Assay description: Inhibition of human recombinant soluble epoxide hydrolase expressed in baculovirus expression system by fluorimetric assay
In DepthDetails ArticlePubMed