BDBM50333084 1-Adamantan-1-yl-3-{3-[5-(4-methyl-piperazin-1-yl)-pentyloxy]-phenyl}-urea::CHEMBL1632476
SMILES CN1CCN(CCCCCOc2cccc(NC(=O)NC34CC5CC(CC(C5)C3)C4)c2)CC1
InChI Key InChIKey=MYBKLMIOOHTTLI-UHFFFAOYSA-N
Data  1 IC50
  Tab Delimited (TSV)   2D SDfile   Computed 3D by Vconf -m prep SDfile
Find this compound or compounds like it in BindingDB:
Activity Spreadsheet -- Enzyme Inhibition Constant Data from BindingDB
Found 1 hit for monomerid = 50333084
TargetBifunctional epoxide hydrolase 2(Homo sapiens (Human))
TBA
Curated by ChEMBL
LigandPNGBDBM50333084(1-Adamantan-1-yl-3-{3-[5-(4-methyl-piperazin-1-yl)...)
Affinity DataIC50:  11.5nM. Assay description: Inhibition of human recombinant soluble epoxide hydrolase expressed in baculovirus expression system by fluorimetric assay
In DepthDetails ArticlePubMed