BDBM50334276 4-phenoxyaniline::CHEMBL249550::US10322118, Entry 10
SMILES Nc1ccc(Oc2ccccc2)cc1
InChI Key InChIKey=WOYZXEVUWXQVNV-UHFFFAOYSA-N
Data  2 KI  3 IC50
  Tab Delimited (TSV)   2D SDfile   Computed 3D by Vconf -m prep SDfile
Find this compound or compounds like it in BindingDB:
Activity Spreadsheet -- Enzyme Inhibition Constant Data from BindingDB
Found 5 hits for monomerid = 50334276
TargetAmine oxidase [flavin-containing] A(Homo sapiens (Human))
North-West University
Curated by ChEMBL
LigandPNGBDBM50334276(4-phenoxyaniline | CHEMBL249550 | US10322118, Entr...)
Affinity DataKi:  2.41E+4nM. Assay description: Inhibition of human recombinant MAOA expressed in insect cells by fluorescence assay
In DepthDetails ArticlePubMed
TargetAmine oxidase [flavin-containing] B(Homo sapiens (Human))
North-West University
Curated by ChEMBL
LigandPNGBDBM50334276(4-phenoxyaniline | CHEMBL249550 | US10322118, Entr...)
Affinity DataKi:  1.31E+5nM. Assay description: Inhibition of human recombinant MAOB expressed in insect cells by fluorescence assay
In DepthDetails ArticlePubMed
TargetPutative hydrolase(Pseudomonas aeruginosa (strain UCBPP-PA14))
Dartmouth College
US Patent
LigandPNGBDBM50334276(4-phenoxyaniline | CHEMBL249550 | US10322118, Entr...)
Affinity DataIC50: >1.00E+5nM. Assay description: The first step in characterizing the two compounds identified by high throughput screening was to verify that the inhibition was reproducible using f...
In DepthDetails US Patent
TargetAmine oxidase [flavin-containing] A(Homo sapiens (Human))
North-West University
Curated by ChEMBL
LigandPNGBDBM50334276(4-phenoxyaniline | CHEMBL249550 | US10322118, Entr...)
Affinity DataIC50:  9.14E+4nM. Assay description: Inhibition of human recombinant MAOA expressed in insect cells by fluorescence assay
In DepthDetails ArticlePubMed
TargetAmine oxidase [flavin-containing] B(Homo sapiens (Human))
North-West University
Curated by ChEMBL
LigandPNGBDBM50334276(4-phenoxyaniline | CHEMBL249550 | US10322118, Entr...)
Affinity DataIC50:  3.03E+5nM. Assay description: Inhibition of human recombinant MAOB expressed in insect cells by fluorescence assay
In DepthDetails ArticlePubMed