BDBM50334453 (S)-5-methyl-2-(quinuclidin-3-yl)-2,3-dihydropyrrolo[4,3,2-de]isoquinolin-1(5H)-one::CHEMBL1643894::US8501729, 4
SMILES Cn1cc2CN([C@@H]3CN4CCC3CC4)C(=O)c3cccc1c23
InChI Key InChIKey=RZKMGDNFMYZIER-MRXNPFEDSA-N
Data  2 KI
  Tab Delimited (TSV)   2D SDfile   Computed 3D by Vconf -m prep SDfile
Find this compound or compounds like it in BindingDB:
Activity Spreadsheet -- Enzyme Inhibition Constant Data from BindingDB
Found 1 hit for monomerid = 50334453
Target5-hydroxytryptamine receptor 3A(Homo sapiens (Human))
Amri
Curated by ChEMBL
LigandPNGBDBM50334453((S)-5-methyl-2-(quinuclidin-3-yl)-2,3-dihydropyrro...)
Affinity DataKi:  0.700nM. Assay description: Binding affinity to human 5HT3A receptor
In DepthDetails ArticlePubMed