BDBM50334460 ((1R,2S,3S,5S)-3-(4-iodophenyl)-8-methyl-8-azabicyclo[3.2.1]octan-2-yl)(pyrrolidin-1-yl)methanone::CHEMBL1643896::RTI-229
SMILES CN1[C@H]2CC[C@@H]1[C@H]([C@H](C2)c1ccc(I)cc1)C(=O)N1CCCC1
InChI Key InChIKey=HPQILAIJSLHQQC-MLHJIOFPSA-N
Data  5 KI  3 IC50
  Tab Delimited (TSV)   2D SDfile   Computed 3D by Vconf -m prep SDfile
Find this compound or compounds like it in BindingDB:
Activity Spreadsheet -- Enzyme Inhibition Constant Data from BindingDB
Found 8 hits for monomerid = 50334460
TargetSodium-dependent dopamine transporter(Rattus norvegicus (rat))
Virginia Commonwealth University
Curated by PDSP Ki Database
LigandPNGBDBM50334460(((1R,2S,3S,5S)-3-(4-iodophenyl)-8-methyl-8-azabicy...)
Affinity DataKi:  0.370nM
In DepthDetails PubMed
LigandPNGBDBM50334460(((1R,2S,3S,5S)-3-(4-iodophenyl)-8-methyl-8-azabicy...)
Affinity DataKi:  19.5nM
In DepthDetails ArticlePubMed
TargetSodium-dependent serotonin transporter(Rattus norvegicus (rat))
Nih
Curated by PDSP Ki Database
LigandPNGBDBM50334460(((1R,2S,3S,5S)-3-(4-iodophenyl)-8-methyl-8-azabicy...)
Affinity DataKi:  362nM
In DepthDetails ArticlePubMed
LigandPNGBDBM50334460(((1R,2S,3S,5S)-3-(4-iodophenyl)-8-methyl-8-azabicy...)
Affinity DataKi:  990nM
In DepthDetails PubMed
TargetSodium-dependent serotonin transporter(Rattus norvegicus (rat))
Nih
Curated by PDSP Ki Database
LigandPNGBDBM50334460(((1R,2S,3S,5S)-3-(4-iodophenyl)-8-methyl-8-azabicy...)
Affinity DataKi:  1.73E+3nM
In DepthDetails PubMed
TargetSodium-dependent serotonin transporter(Homo sapiens (Human))
The University Of Sydney
Curated by ChEMBL
LigandPNGBDBM50334460(((1R,2S,3S,5S)-3-(4-iodophenyl)-8-methyl-8-azabicy...)
Affinity DataIC50:  991nM. Assay description: Inhibition of SERT
In DepthDetails ArticlePubMed
TargetSodium-dependent dopamine transporter(Homo sapiens (Human))
The University Of Sydney
Curated by ChEMBL
LigandPNGBDBM50334460(((1R,2S,3S,5S)-3-(4-iodophenyl)-8-methyl-8-azabicy...)
Affinity DataIC50:  0.370nM. Assay description: Inhibition of DAT
In DepthDetails ArticlePubMed
TargetSodium-dependent noradrenaline transporter(Homo sapiens (Human))
The University Of Sydney
Curated by ChEMBL
LigandPNGBDBM50334460(((1R,2S,3S,5S)-3-(4-iodophenyl)-8-methyl-8-azabicy...)
Affinity DataIC50:  1.73E+3nM. Assay description: Inhibition of NET
In DepthDetails ArticlePubMed