BDBM50335220 CHEMBL1650804::ethyl 1-(phenylsulfonyl)piperidine-2-carboxylate
SMILES CCOC(=O)C1CCCCN1S(=O)(=O)c1ccccc1
InChI Key InChIKey=MSZJBCLQSZKRQD-UHFFFAOYSA-N
Data  2 IC50
  Tab Delimited (TSV)   2D SDfile   Computed 3D by Vconf -m prep SDfile
Find this compound or compounds like it in BindingDB:
Activity Spreadsheet -- Enzyme Inhibition Constant Data from BindingDB
Found 2 hits for monomerid = 50335220
TargetPeptidyl-prolyl cis-trans isomerase FKBP1A(Homo sapiens (Human))
University Of Wu£Rzburg
Curated by ChEMBL
LigandPNGBDBM50335220(CHEMBL1650804 | ethyl 1-(phenylsulfonyl)piperidine...)
Affinity DataIC50:  3.10E+3nM. Assay description: Inhibition of PPIase activity of human FKBP12 expressed in Escherichia coli by spectrophotometry
In DepthDetails ArticlePubMed
TargetOuter membrane protein MIP(Legionella pneumophila)
University Of Wu£Rzburg
Curated by ChEMBL
LigandPNGBDBM50335220(CHEMBL1650804 | ethyl 1-(phenylsulfonyl)piperidine...)
Affinity DataIC50: >1.00E+5nM. Assay description: Inhibition of PPIase activity of Legionella pneumophila MIP protein expressed in Escherichia coli by spectrophotometry
In DepthDetails ArticlePubMed