BDBM50335229 3-(pyridin-3-yl)propyl 1-(3-aminophenylsulfonyl)piperidine-2-carboxylate::CHEMBL1650950
SMILES Nc1cccc(c1)S(=O)(=O)N1CCCCC1C(=O)OCCCc1cccnc1
InChI Key InChIKey=KIHNEFUZIVKXTN-UHFFFAOYSA-N
Data  2 IC50
  Tab Delimited (TSV)   2D SDfile   Computed 3D by Vconf -m prep SDfile
Find this compound or compounds like it in BindingDB:
Activity Spreadsheet -- Enzyme Inhibition Constant Data from BindingDB
Found 2 hits for monomerid = 50335229
TargetPeptidyl-prolyl cis-trans isomerase FKBP1A(Homo sapiens (Human))
University Of Wu£Rzburg
Curated by ChEMBL
LigandPNGBDBM50335229(3-(pyridin-3-yl)propyl 1-(3-aminophenylsulfonyl)pi...)
Affinity DataIC50:  320nM. Assay description: Inhibition of PPIase activity of human FKBP12 expressed in Escherichia coli by spectrophotometry
In DepthDetails ArticlePubMed
TargetOuter membrane protein MIP(Legionella pneumophila)
University Of Wu£Rzburg
Curated by ChEMBL
LigandPNGBDBM50335229(3-(pyridin-3-yl)propyl 1-(3-aminophenylsulfonyl)pi...)
Affinity DataIC50: >1.00E+5nM. Assay description: Inhibition of PPIase activity of Legionella pneumophila MIP protein expressed in Escherichia coli by spectrophotometry
In DepthDetails ArticlePubMed