BDBM50337097 (S)-1-(2-(Propan-2-yl)benzamido)ethaneboronic acid::CHEMBL1672905
SMILES CC(C)c1ccccc1C(=O)N[C@H](C)B(O)O
InChI Key InChIKey=NPKNYHIQNGQUEQ-SECBINFHSA-N
Data  1 IC50
  Tab Delimited (TSV)   2D SDfile   Computed 3D by Vconf -m prep SDfile
Find this compound or compounds like it in BindingDB:
Activity Spreadsheet -- Enzyme Inhibition Constant Data from BindingDB
Found 1 hit for monomerid = 50337097
TargetD-alanyl-D-alanine carboxypeptidase(Actinomadura sp. (strain R39))
TBA
Curated by ChEMBL
LigandPNGBDBM50337097((S)-1-(2-(Propan-2-yl)benzamido)ethaneboronic acid...)
Affinity DataIC50:  5.90E+4nM. Assay description: Inhibition of Actinomadura R39 PBP after 60 mins
In DepthDetails ArticlePubMed