BDBM50337324 3-benzyl-5-(1H-indazol-5-yl)isoxazole::CHEMBL1682357
SMILES C(c1cc(on1)-c1ccc2[nH]ncc2c1)c1ccccc1
InChI Key InChIKey=WKWGFJFNCXAUEX-UHFFFAOYSA-N
Data  8 KI
  Tab Delimited (TSV)   2D SDfile   Computed 3D by Vconf -m prep SDfile
Find this compound or compounds like it in BindingDB:
Activity Spreadsheet -- Enzyme Inhibition Constant Data from BindingDB
Found 8 hits for monomerid = 50337324
TargetRho-associated protein kinase 2(Homo sapiens (Human))
Abbott Laboratories
Curated by ChEMBL
LigandPNGBDBM50337324(3-benzyl-5-(1H-indazol-5-yl)isoxazole | CHEMBL1682...)
Affinity DataKi:  28nM. Assay description: Inhibition of Rock2 after 1 hr using biotinylated longS peptide as substrate
In DepthDetails ArticlePubMed
TargetAurora kinase B(Homo sapiens (Human))
Abbott Laboratories
Curated by ChEMBL
LigandPNGBDBM50337324(3-benzyl-5-(1H-indazol-5-yl)isoxazole | CHEMBL1682...)
Affinity DataKi:  323nM. Assay description: Inhibition of Aurora kinase 2 after 1 hr using biotinylated kemptide as substrate
In DepthDetails ArticlePubMed
TargetTyrosine-protein kinase JAK2(Homo sapiens (Human))
Abbott Laboratories
Curated by ChEMBL
LigandPNGBDBM50337324(3-benzyl-5-(1H-indazol-5-yl)isoxazole | CHEMBL1682...)
Affinity DataKi:  351nM. Assay description: Inhibition of JAK2 after 1 hr using biotinylated PDKtide as substrate
In DepthDetails ArticlePubMed
TargetGlycogen synthase kinase-3 beta(Homo sapiens (Human))
Abbott Laboratories
Curated by ChEMBL
LigandPNGBDBM50337324(3-benzyl-5-(1H-indazol-5-yl)isoxazole | CHEMBL1682...)
Affinity DataKi:  572nM. Assay description: Inhibition of GSK3-beta after 1 hr
In DepthDetails ArticlePubMed
TargetEpidermal growth factor receptor(Homo sapiens (Human))
Abbott Laboratories
Curated by ChEMBL
LigandPNGBDBM50337324(3-benzyl-5-(1H-indazol-5-yl)isoxazole | CHEMBL1682...)
Affinity DataKi: >1.80E+3nM. Assay description: Inhibition of EGFR after 1 hr
In DepthDetails ArticlePubMed
TargetSerine/threonine-protein kinase PAK 4(Homo sapiens (Human))
Abbott Laboratories
Curated by ChEMBL
LigandPNGBDBM50337324(3-benzyl-5-(1H-indazol-5-yl)isoxazole | CHEMBL1682...)
Affinity DataKi: >3.75E+3nM. Assay description: Inhibition of Pak4 after 1 hr using biotinylated L15 peptide as substrate
In DepthDetails ArticlePubMed
TargetSerine/threonine-protein kinase pim-1(Homo sapiens (Human))
Abbott Laboratories
Curated by ChEMBL
LigandPNGBDBM50337324(3-benzyl-5-(1H-indazol-5-yl)isoxazole | CHEMBL1682...)
Affinity DataKi: >8.57E+3nM. Assay description: Inhibition of Pim1 after 1 hr using biotinylated AL1peptide as substrate
In DepthDetails ArticlePubMed
TargetVascular endothelial growth factor receptor 2(Homo sapiens (Human))
Abbott Laboratories
Curated by ChEMBL
LigandPNGBDBM50337324(3-benzyl-5-(1H-indazol-5-yl)isoxazole | CHEMBL1682...)
Affinity DataKi: >8.88E+3nM. Assay description: Inhibition of KDR after 1 hr
In DepthDetails ArticlePubMed