BDBM50338533 CHEMBL1683588::N-(1-methyl-1H-pyrazol-3-yl)-1-(3-(trifluoromethyl)benzyl)-1H-1,2,4-triazole-3-carboxamide
SMILES Cn1ccc(NC(=O)c2ncn(Cc3cccc(c3)C(F)(F)F)n2)n1
InChI Key InChIKey=WQYFWLITGIGCJR-UHFFFAOYSA-N
Data  1 IC50
  Tab Delimited (TSV)   2D SDfile   Computed 3D by Vconf -m prep SDfile
Find this compound or compounds like it in BindingDB:
Activity Spreadsheet -- Enzyme Inhibition Constant Data from BindingDB
Found 1 hit for monomerid = 50338533
TargetAcyl-CoA desaturase 1(Rattus norvegicus (Rat))
Pfizer
Curated by ChEMBL
LigandPNGBDBM50338533(CHEMBL1683588 | N-(1-methyl-1H-pyrazol-3-yl)-1-(3-...)
Affinity DataIC50:  113nM. Assay description: Inhibition of rat liver SCD1 using [3H]-stearoylCoA
In DepthDetails ArticlePubMed