BDBM50338555 CHEMBL4161856
SMILES CC(C)C[C@H](NC(C)=O)C(=O)N[C@@H](C)C(=O)N[C@@H](CC(C)C)C(=O)N[C@@H](CCCCN)C(=O)N[C@@H](Cc1ccc(N)cc1)C(=O)N[C@@H](CC(C)C)C(=O)N[C@@H](CC(C)C)C(=O)N[C@@H]([C@@H](C)O)C(=O)N1CCC[C@H]1C(=O)N[C@@H](C(C)C)C(N)=O
InChI Key InChIKey=HBMUSHYHNFTSRL-AXRSMUBWSA-N
Data  1 KI
  Tab Delimited (TSV)   2D SDfile   Computed 3D by Vconf -m prep SDfile
Find this compound or compounds like it in BindingDB:
Activity Spreadsheet -- Enzyme Inhibition Constant Data from BindingDB
Found 1 hit for monomerid = 50338555
TargetTelomeric repeat-binding factor 2(Homo sapiens)
China Pharmaceutical University
Curated by ChEMBL
LigandPNGBDBM50338555(CHEMBL4161856)
Affinity DataKi:  720nM. Assay description: Displacement of 5-((2R,6S,9S,12S,15S,18S,21S,24S)-3-((S)-2-((S)-1-amino-3-methyl-1-oxobutan-2-ylcarbamoyl)pyrrolidine-1-carbonyl)-15-(4-aminobutyl)-2...
In DepthDetails ArticlePubMed