BDBM50338578 CHEMBL4173933
SMILES CC(C)C[C@@H]1NC(=O)[C@H](CCCCCCC[C@H](NC(=O)[C@@H]2CCCN2C(=O)[C@H](C)NC1=O)C(=O)N(C)C)NC(=O)[C@H](Cc1ccc(O)cc1)NC(=O)[C@@H](N)CCCCN
InChI Key InChIKey=IXDGTQLHIYAWHI-FKBNJGARSA-N
Data  1 KI
  Tab Delimited (TSV)   2D SDfile   Computed 3D by Vconf -m prep SDfile
Find this compound or compounds like it in BindingDB:
Activity Spreadsheet -- Enzyme Inhibition Constant Data from BindingDB
Found 1 hit for monomerid = 50338578
TargetTelomeric repeat-binding factor 2(Homo sapiens)
China Pharmaceutical University
Curated by ChEMBL
LigandPNGBDBM50338578(CHEMBL4173933)
Affinity DataKi:  1.84E+4nM. Assay description: Displacement of 5-((2R,6S,9S,12S,15S,18S,21S,24S)-3-((S)-2-((S)-1-amino-3-methyl-1-oxobutan-2-ylcarbamoyl)pyrrolidine-1-carbonyl)-15-(4-aminobutyl)-2...
In DepthDetails ArticlePubMed