BDBM50340102 CHEMBL1762820::N-ethyl-N-(3-fluoropropyl)-8-(6-methoxy-2-methylpyridin-3-yl)-2,7-dimethylpyrazolo[1,5-a][1,3,5]triazin-4-amine
SMILES CCN(CCCF)c1nc(C)nc2c(c(C)nn12)-c1ccc(OC)nc1C
InChI Key InChIKey=IGSBLGMDGZRMAE-UHFFFAOYSA-N
Data  1 IC50
  Tab Delimited (TSV)   2D SDfile   Computed 3D by Vconf -m prep SDfile
Find this compound or compounds like it in BindingDB:
Activity Spreadsheet -- Enzyme Inhibition Constant Data from BindingDB
Found 1 hit for monomerid = 50340102
TargetCorticotropin-releasing factor receptor 1(Rattus norvegicus (rat))
Bristol-Myers Squibb Research And Development
Curated by ChEMBL
LigandPNGBDBM50340102(CHEMBL1762820 | N-ethyl-N-(3-fluoropropyl)-8-(6-me...)
Affinity DataIC50:  1.60nM. Assay description: Displacement of [125I]-o-CRF from CRF1 receptor in rat frontal cortex by rapid filtration technique
In DepthDetails ArticlePubMed