BDBM50340105 CHEMBL1762823::N-(3-fluoropropyl)-N-(2-methoxyethyl)-8-(6-methoxypyridin-3-yl)-2,7-dimethylpyrazolo[1,5-a][1,3,5]triazin-4-amine
SMILES COCCN(CCCF)c1nc(C)nc2c(c(C)nn12)-c1ccc(OC)nc1
InChI Key InChIKey=BLOMLVIWSNVQDS-UHFFFAOYSA-N
Data  1 IC50
  Tab Delimited (TSV)   2D SDfile   Computed 3D by Vconf -m prep SDfile
Find this compound or compounds like it in BindingDB:
Activity Spreadsheet -- Enzyme Inhibition Constant Data from BindingDB
Found 1 hit for monomerid = 50340105
TargetCorticotropin-releasing factor receptor 1(Rattus norvegicus (rat))
Bristol-Myers Squibb Research And Development
Curated by ChEMBL
LigandPNGBDBM50340105(CHEMBL1762823 | N-(3-fluoropropyl)-N-(2-methoxyeth...)
Affinity DataIC50:  35nM. Assay description: Displacement of [125I]-o-CRF from CRF1 receptor in rat frontal cortex by rapid filtration technique
In DepthDetails ArticlePubMed