BDBM50340999 CHEMBL1762418::N-(5-tert-butylisoxazol-3-yl)-4-(tetrahydro-2H-pyran-2-carbonyl)-1,4-diazepane-1-carboxamide
SMILES CC(C)(C)c1cc(NC(=O)N2CCCN(CC2)C(=O)C2CCCCO2)no1
InChI Key InChIKey=AOCSQGAXWSYTPJ-UHFFFAOYSA-N
Data  2 EC50
  Tab Delimited (TSV)   2D SDfile   Computed 3D by Vconf -m prep SDfile
Find this compound or compounds like it in BindingDB:
Activity Spreadsheet -- Enzyme Inhibition Constant Data from BindingDB
Found 2 hits for monomerid = 50340999
TargetCannabinoid receptor 1(Homo sapiens (Human))
Boehringer Ingelheim Pharmaceuticals
Curated by ChEMBL
LigandPNGBDBM50340999(CHEMBL1762418 | N-(5-tert-butylisoxazol-3-yl)-4-(t...)
Affinity DataEC50: >2.00E+4nM. Assay description: Agonist activity at human CB1 receptor transfected in CHO cells assessed as inhibition of forskolin-stimulated cAMP production
In DepthDetails ArticlePubMed
TargetCannabinoid receptor 2(Homo sapiens (Human))
Boehringer Ingelheim Pharmaceuticals
Curated by ChEMBL
LigandPNGBDBM50340999(CHEMBL1762418 | N-(5-tert-butylisoxazol-3-yl)-4-(t...)
Affinity DataEC50:  750nM. Assay description: Agonist activity at human CB2 receptor transfected in CHO cells assessed as inhibition of forskolin-stimulated cAMP production
In DepthDetails ArticlePubMed