BDBM50341787 (1S,2R,3R)-1-[(S)-4-(4-Chlorophenyl)-3-methylpiperazine-1-sulfonylamino]-2-methyl-3-phenylcyclopropanecarboxylic Acid::CHEMBL1766909
SMILES C[C@@H]1[C@H](c2ccccc2)[C@]1(NS(=O)(=O)N1CCN([C@@H](C)C1)c1ccc(Cl)cc1)C(O)=O
InChI Key InChIKey=STTHHFYKRNBSEX-LZWBKRQXSA-N
Data  4 IC50
  Tab Delimited (TSV)   2D SDfile   Computed 3D by Vconf -m prep SDfile
Find this compound or compounds like it in BindingDB:
Activity Spreadsheet -- Enzyme Inhibition Constant Data from BindingDB
Found 4 hits for monomerid = 50341787
TargetMatrix metalloproteinase-14(Homo sapiens (Human))
Central Pharmaceutical Research Institute
Curated by ChEMBL
LigandPNGBDBM50341787((1S,2R,3R)-1-[(S)-4-(4-Chlorophenyl)-3-methylpiper...)
Affinity DataIC50:  2.50E+3nM. Assay description: Inhibition of human recombinant MMP14 after 60 mins by fluorescence plate reader
In DepthDetails ArticlePubMed
TargetDisintegrin and metalloproteinase domain-containing protein 17(Homo sapiens (Human))
Central Pharmaceutical Research Institute
Curated by ChEMBL
LigandPNGBDBM50341787((1S,2R,3R)-1-[(S)-4-(4-Chlorophenyl)-3-methylpiper...)
Affinity DataIC50: >1.00E+4nM. Assay description: Inhibition of human recombinant TACE after 60 mins by fluorescence plate reader
In DepthDetails ArticlePubMed
TargetInterstitial collagenase(Homo sapiens (Human))
Central Pharmaceutical Research Institute
Curated by ChEMBL
LigandPNGBDBM50341787((1S,2R,3R)-1-[(S)-4-(4-Chlorophenyl)-3-methylpiper...)
Affinity DataIC50: >1.00E+4nM. Assay description: Inhibition of human recombinant MMP1 after 60 mins by fluorescence plate reader
In DepthDetails ArticlePubMed
TargetA disintegrin and metalloproteinase with thrombospondin motifs 5(Homo sapiens (Human))
Central Pharmaceutical Research Institute
Curated by ChEMBL
LigandPNGBDBM50341787((1S,2R,3R)-1-[(S)-4-(4-Chlorophenyl)-3-methylpiper...)
Affinity DataIC50:  47nM. Assay description: Inhibition of human recombinant aggrecanase 2 after 150 mins by fluorescence plate reader
In DepthDetails ArticlePubMed