BDBM50341811 (1S,2R,3R)-2,3-Dimethyl-1-(8-fluoro-1,2,3,4-tetrahydropyrazino[1,2-a]benzimidazole-2-sulfonylamino)-2-phenylcyclopropanecarboxylicAcid::CHEMBL1767013
SMILES C[C@@H]1[C@](C)(c2ccccc2)[C@]1(NS(=O)(=O)N1CCn2c(C1)nc1cc(F)ccc21)C(O)=O
InChI Key InChIKey=COXUXHHGASUMFC-KHIBUBOWSA-N
Data  4 IC50
  Tab Delimited (TSV)   2D SDfile   Computed 3D by Vconf -m prep SDfile
Find this compound or compounds like it in BindingDB:
Activity Spreadsheet -- Enzyme Inhibition Constant Data from BindingDB
Found 4 hits for monomerid = 50341811
TargetA disintegrin and metalloproteinase with thrombospondin motifs 5(Homo sapiens (Human))
Central Pharmaceutical Research Institute
Curated by ChEMBL
LigandPNGBDBM50341811((1S,2R,3R)-2,3-Dimethyl-1-(8-fluoro-1,2,3,4-tetrah...)
Affinity DataIC50:  14nM. Assay description: Inhibition of human recombinant aggrecanase 2 after 150 mins by fluorescence plate reader
In DepthDetails ArticlePubMed
TargetDisintegrin and metalloproteinase domain-containing protein 17(Homo sapiens (Human))
Central Pharmaceutical Research Institute
Curated by ChEMBL
LigandPNGBDBM50341811((1S,2R,3R)-2,3-Dimethyl-1-(8-fluoro-1,2,3,4-tetrah...)
Affinity DataIC50: >1.00E+4nM. Assay description: Inhibition of human recombinant TACE after 60 mins by fluorescence plate reader
In DepthDetails ArticlePubMed
TargetInterstitial collagenase(Homo sapiens (Human))
Central Pharmaceutical Research Institute
Curated by ChEMBL
LigandPNGBDBM50341811((1S,2R,3R)-2,3-Dimethyl-1-(8-fluoro-1,2,3,4-tetrah...)
Affinity DataIC50: >1.00E+4nM. Assay description: Inhibition of human recombinant MMP1 after 60 mins by fluorescence plate reader
In DepthDetails ArticlePubMed
TargetMatrix metalloproteinase-14(Homo sapiens (Human))
Central Pharmaceutical Research Institute
Curated by ChEMBL
LigandPNGBDBM50341811((1S,2R,3R)-2,3-Dimethyl-1-(8-fluoro-1,2,3,4-tetrah...)
Affinity DataIC50: >1.00E+4nM. Assay description: Inhibition of human recombinant MMP14 after 60 mins by fluorescence plate reader
In DepthDetails ArticlePubMed