BDBM50342623 CHEMBL1770568::N-((6S,9R)-6-(2,3-difluorophenyl)-3-isopropyl-6,7,8,9-tetrahydro-5H-imidazo[1,2-a]azepin-9-yl)-4-(2-oxo-2,3-dihydro-1H-imidazo[4,5-b]pyridin-1-yl)piperidine-1-carboxamide
SMILES CC(C)c1cnc2[C@@H](CC[C@H](Cn12)c1cccc(F)c1F)NC(=O)N1CCC(CC1)n1c2cccnc2[nH]c1=O
InChI Key InChIKey=QFXXYEKLOZNNSU-XMSQKQJNSA-N
Data  1 KI  2 IC50
  Tab Delimited (TSV)   2D SDfile   Computed 3D by Vconf -m prep SDfile
Find this compound or compounds like it in BindingDB:
Activity Spreadsheet -- Enzyme Inhibition Constant Data from BindingDB
Found 3 hits for monomerid = 50342623
TargetCalcitonin gene-related peptide type 1 receptor(Homo sapiens (Human))
Merck Research Laboratories
Curated by ChEMBL
LigandPNGBDBM50342623(CHEMBL1770568 | N-((6S,9R)-6-(2,3-difluorophenyl)-...)
Affinity DataKi:  0.690nM. Assay description: Displacement of [125I]-CGRP from human recombinant CGRP receptor
In DepthDetails ArticlePubMed
TargetCalcitonin gene-related peptide type 1 receptor(Homo sapiens (Human))
Merck Research Laboratories
Curated by ChEMBL
LigandPNGBDBM50342623(CHEMBL1770568 | N-((6S,9R)-6-(2,3-difluorophenyl)-...)
Affinity DataIC50:  3.20nM. Assay description: Antagonist activity at CGRP receptor assessed as inhibition of CGRP-stimulated cAMP production by cell based assay in presence of 50% human serum
In DepthDetails ArticlePubMed
TargetCalcitonin gene-related peptide type 1 receptor(Homo sapiens (Human))
Merck Research Laboratories
Curated by ChEMBL
LigandPNGBDBM50342623(CHEMBL1770568 | N-((6S,9R)-6-(2,3-difluorophenyl)-...)
Affinity DataIC50:  0.620nM. Assay description: Antagonist activity at CGRP receptor assessed as inhibition of CGRP-stimulated cAMP production by cell based assay
In DepthDetails ArticlePubMed