BDBM50342660 4-(3-(4-aminopyridin-2-yl)phenyl)but-3-yn-1-ol::CHEMBL1770739
SMILES Nc1ccnc(c1)-c1cccc(c1)C#CCCO
InChI Key InChIKey=FORDSOYHQBFBOM-UHFFFAOYSA-N
Data  1 IC50
  Tab Delimited (TSV)   2D SDfile   Computed 3D by Vconf -m prep SDfile
Find this compound or compounds like it in BindingDB:
Activity Spreadsheet -- Enzyme Inhibition Constant Data from BindingDB
Found 1 hit for monomerid = 50342660
TargetAcid-sensing ion channel 3(Homo sapiens (Human))
Merck Research Laboratories
Curated by ChEMBL
LigandPNGBDBM50342660(4-(3-(4-aminopyridin-2-yl)phenyl)but-3-yn-1-ol | C...)
Affinity DataIC50:  2.60E+3nM. Assay description: Inhibition of human ASIC3 expressed in HEK293 cells assessed as inhibition of acid-evoked current by manual patch-clamp electrophysiology assay
In DepthDetails ArticlePubMed