BDBM50342661 2-(3-(phenylethynyl)phenyl)pyridin-4-amine::CHEMBL1770740
SMILES Nc1ccnc(c1)-c1cccc(c1)C#Cc1ccccc1
InChI Key InChIKey=HQWVBEBSVKZWKG-UHFFFAOYSA-N
Data  1 IC50
  Tab Delimited (TSV)   2D SDfile   Computed 3D by Vconf -m prep SDfile
Find this compound or compounds like it in BindingDB:
Activity Spreadsheet -- Enzyme Inhibition Constant Data from BindingDB
Found 1 hit for monomerid = 50342661
TargetAcid-sensing ion channel 3(Homo sapiens (Human))
Merck Research Laboratories
Curated by ChEMBL
LigandPNGBDBM50342661(2-(3-(phenylethynyl)phenyl)pyridin-4-amine | CHEMB...)
Affinity DataIC50:  1.20E+3nM. Assay description: Inhibition of human ASIC3 expressed in HEK293 cells assessed as inhibition of acid-evoked current by manual patch-clamp electrophysiology assay
In DepthDetails ArticlePubMed