BDBM50343640 CHEMBL1774963::cis-2-((1R,2S,5S)-3-((S)-4-methyl-2-((E)-3-(4-(phosphonooxy)phenyl)but-2-enamido)pentanoyl)-3-azabicyclo[3.1.0]hexane-2-carboxamido)ethyl carbamate
SMILES CC(C)C[C@H](NC(=O)C=C(C)c1ccc(OP(O)(O)=O)cc1)C(=O)N1C[C@H]2C[C@H]2[C@H]1C(=O)NCCOC(N)=O
InChI Key InChIKey=JTIMSSSNDZQRFF-PBVWOCPUSA-N
Data  1 KI
  Tab Delimited (TSV)   2D SDfile   Computed 3D by Vconf -m prep SDfile
Find this compound or compounds like it in BindingDB:
Activity Spreadsheet -- Enzyme Inhibition Constant Data from BindingDB
Found 1 hit for monomerid = 50343640
TargetSignal transducer and activator of transcription 3(Homo sapiens (Human))
University Of Texas M. D. Anderson Cancer Center
Curated by ChEMBL
LigandPNGBDBM50343640(CHEMBL1774963 | cis-2-((1R,2S,5S)-3-((S)-4-methyl-...)
Affinity DataKi:  193nM. Assay description: Binding affinity to SH2 domain of Stat3 by fluorescence polarization assay
In DepthDetails ArticlePubMed