BDBM50343645 4-((E)-4-((3S,6S)-6-((R)-5-amino-5-oxopentan-2-ylcarbamoyl)-4-oxo-1,2,3,4,6,7-hexahydroazepino[3,2,1-hi]indol-3-ylamino)-4-oxobut-2-en-2-yl)phenyl dihydrogen phosphate::CHEMBL1774968
SMILES C[C@H](CCC(N)=O)NC(=O)[C@@H]1Cc2cccc3CC[C@H](NC(=O)\C=C(/C)c4ccc(OP(O)(O)=O)cc4)C(=O)N1c23
InChI Key InChIKey=WXFPTQQEOSUEIX-XXCMHTDNSA-N
Data  1 KI
  Tab Delimited (TSV)   2D SDfile   Computed 3D by Vconf -m prep SDfile
Find this compound or compounds like it in BindingDB:
Activity Spreadsheet -- Enzyme Inhibition Constant Data from BindingDB
Found 1 hit for monomerid = 50343645
TargetSignal transducer and activator of transcription 3(Homo sapiens (Human))
University Of Texas M. D. Anderson Cancer Center
Curated by ChEMBL
LigandPNGBDBM50343645(4-((E)-4-((3S,6S)-6-((R)-5-amino-5-oxopentan-2-ylc...)
Affinity DataKi:  105nM. Assay description: Binding affinity to SH2 domain of Stat3 by fluorescence polarization assay
In DepthDetails ArticlePubMed