BDBM50343789 CHEMBL1774385::N-(3-Fluoro-4-(4-(2-methoxyphenyl)piperazin-1-yl)butyl)-benzofuran-2-carboxamide
SMILES COc1ccccc1N1CCN(CC(F)CCNC(=O)c2cc3ccccc3o2)CC1
InChI Key InChIKey=VGOPWFPTLSPLJJ-UHFFFAOYSA-N
Data  4 KI  1 IC50  1 EC50
  Tab Delimited (TSV)   2D SDfile   Computed 3D by Vconf -m prep SDfile
Find this compound or compounds like it in BindingDB:
Activity Spreadsheet -- Enzyme Inhibition Constant Data from BindingDB
Found 6 hits for monomerid = 50343789
TargetD(3) dopamine receptor(Homo sapiens (Human))
National Institute On Drug Abuse-Intramural Research Program
Curated by ChEMBL
LigandPNGBDBM50343789(CHEMBL1774385 | N-(3-Fluoro-4-(4-(2-methoxyphenyl)...)
Affinity DataKi:  28.6nM. Assay description: Displacement of [125I]-IABN from human dopamine D3 receptor expressed in HEK293 cells after 60 mins by gamma counting
In DepthDetails ArticlePubMed
Target5-hydroxytryptamine receptor 1A(Homo sapiens (Human))
National Institute On Drug Abuse-Intramural Research Program
Curated by ChEMBL
LigandPNGBDBM50343789(CHEMBL1774385 | N-(3-Fluoro-4-(4-(2-methoxyphenyl)...)
Affinity DataKi:  37.9nM. Assay description: Displacement of [3H]8-OH-DPAT from 5HT1A receptor
In DepthDetails ArticlePubMed
TargetD(2) dopamine receptor(Homo sapiens (Human))
National Institute On Drug Abuse-Intramural Research Program
Curated by ChEMBL
LigandPNGBDBM50343789(CHEMBL1774385 | N-(3-Fluoro-4-(4-(2-methoxyphenyl)...)
Affinity DataKi:  329nM. Assay description: Displacement of [125I]-IABN from human dopamine D2L receptor expressed in HEK293 cells after 60 mins by gamma counting
In DepthDetails ArticlePubMed
Target5-hydroxytryptamine receptor 2A(Homo sapiens (Human))
National Institute On Drug Abuse-Intramural Research Program
Curated by ChEMBL
LigandPNGBDBM50343789(CHEMBL1774385 | N-(3-Fluoro-4-(4-(2-methoxyphenyl)...)
Affinity DataKi:  4.80E+3nM. Assay description: Displacement of [125I]DOI from 5HT2A receptor
In DepthDetails ArticlePubMed
Target5-hydroxytryptamine receptor 1A(Homo sapiens (Human))
National Institute On Drug Abuse-Intramural Research Program
Curated by ChEMBL
LigandPNGBDBM50343789(CHEMBL1774385 | N-(3-Fluoro-4-(4-(2-methoxyphenyl)...)
Affinity DataEC50:  134nM. Assay description: Agonist activity at 5HT1A receptor assessed as stimulation of [35S]GTPgammaS binding
In DepthDetails ArticlePubMed
TargetD(3) dopamine receptor(Homo sapiens (Human))
National Institute On Drug Abuse-Intramural Research Program
Curated by ChEMBL
LigandPNGBDBM50343789(CHEMBL1774385 | N-(3-Fluoro-4-(4-(2-methoxyphenyl)...)
Affinity DataIC50:  440nM. Assay description: Antagonist activity at human dopamine D3 receptor expressed in CHOp cells assessed as inhibition of quinopirole-induced mitogenisis
In DepthDetails ArticlePubMed