BDBM50344584 3-(4-(2-(3-cyclohexyl-2-(furan-3-yl)-1-methyl-1H-indole-6-carboxamido)-2-methylpropanamido)phenyl)acrylic acid::CHEMBL1778587
SMILES Cn1c(-c2ccoc2)c(C2CCCCC2)c2ccc(cc12)C(=O)NC(C)(C)C(=O)Nc1ccc(\C=C\C(O)=O)cc1
InChI Key InChIKey=LCPOJFADYAPLKQ-LFIBNONCSA-N
Data  4 IC50
  Tab Delimited (TSV)   2D SDfile   Computed 3D by Vconf -m prep SDfile
Find this compound or compounds like it in BindingDB:
Activity Spreadsheet -- Enzyme Inhibition Constant Data from BindingDB
Found 4 hits for monomerid = 50344584
TargetCytochrome P450 2C9(Homo sapiens (Human))
Boehringer Ingelheim (Canada)
Curated by ChEMBL
LigandPNGBDBM50344584(3-(4-(2-(3-cyclohexyl-2-(furan-3-yl)-1-methyl-1H-i...)
Affinity DataIC50:  2.40E+3nM. Assay description: Inhibition of CYP2C9
In DepthDetails ArticlePubMed
TargetCytochrome P450 3A4(Homo sapiens (Human))
Boehringer Ingelheim (Canada)
Curated by ChEMBL
LigandPNGBDBM50344584(3-(4-(2-(3-cyclohexyl-2-(furan-3-yl)-1-methyl-1H-i...)
Affinity DataIC50:  8.70E+3nM. Assay description: Inhibition of CYP3A4
In DepthDetails ArticlePubMed
TargetCytochrome P450 2D6(Homo sapiens (Human))
Boehringer Ingelheim (Canada)
Curated by ChEMBL
LigandPNGBDBM50344584(3-(4-(2-(3-cyclohexyl-2-(furan-3-yl)-1-methyl-1H-i...)
Affinity DataIC50:  9.00E+3nM. Assay description: Inhibition of CYP2D6
In DepthDetails ArticlePubMed
TargetCytochrome P450 2C19(Homo sapiens (Human))
Boehringer Ingelheim (Canada)
Curated by ChEMBL
LigandPNGBDBM50344584(3-(4-(2-(3-cyclohexyl-2-(furan-3-yl)-1-methyl-1H-i...)
Affinity DataIC50:  4.20E+3nM. Assay description: Inhibition of CYP2C19
In DepthDetails ArticlePubMed