BDBM50344697 2'-(2-(benzofuran-2-yl)pyrimidin-4-yl)-5',6'-dihydrospiro[piperidine-4,7'-pyrrolo[3,2-c]pyridin]-4'(1'H)-one::CHEMBL1779352
SMILES O=C1NCC2(CCNCC2)c2[nH]c(cc12)-c1ccnc(n1)-c1cc2ccccc2o1
InChI Key InChIKey=YIOWMBJTJDJKEK-UHFFFAOYSA-N
Data  2 EC50
  Tab Delimited (TSV)   2D SDfile   Computed 3D by Vconf -m prep SDfile
Find this compound or compounds like it in BindingDB:
Activity Spreadsheet -- Enzyme Inhibition Constant Data from BindingDB
Found 2 hits for monomerid = 50344697
TargetMAP kinase-activated protein kinase 2(Homo sapiens (Human))
Merck Research Laboratories
Curated by ChEMBL
LigandPNGBDBM50344697(2'-(2-(benzofuran-2-yl)pyrimidin-4-yl)-5',6'-dihyd...)
Affinity DataEC50:  5.90nM. Assay description: Inhibition of MK2 pretreated for 30 mins before fluorescein labeled substrate peptide addition measured after 2 hrs by IMAP assay
In DepthDetails ArticlePubMed
TargetMAP kinase-activated protein kinase 2(Homo sapiens (Human))
Merck Research Laboratories
Curated by ChEMBL
LigandPNGBDBM50344697(2'-(2-(benzofuran-2-yl)pyrimidin-4-yl)-5',6'-dihyd...)
Affinity DataEC50:  1.20E+3nM. Assay description: Inhibition of MK2 in LPS-stimulated human THP1 cells assessed as inhibition of Hsp27 phosphorylation pretreated 60 mins before LPS challenge measured...
In DepthDetails ArticlePubMed