BDBM50345123 5-(ethylthio)-2-methyl-[1,2,4]triazolo[1,5-c]quinazoline::CHEMBL1779265
SMILES CCSc1nc2ccccc2c2nc(C)nn12
InChI Key InChIKey=CCPVGWJWOWFLEG-UHFFFAOYSA-N
Data  1 IC50
  Tab Delimited (TSV)   2D SDfile   Computed 3D by Vconf -m prep SDfile
Find this compound or compounds like it in BindingDB:
Activity Spreadsheet -- Enzyme Inhibition Constant Data from BindingDB
Found 1 hit for monomerid = 50345123
TargetcAMP and cAMP-inhibited cGMP 3',5'-cyclic phosphodiesterase 10A(Homo sapiens (Human))
H. Lundbeck
Curated by ChEMBL
LigandPNGBDBM50345123(5-(ethylthio)-2-methyl-[1,2,4]triazolo[1,5-c]quina...)
Affinity DataIC50:  2.40E+3nM. Assay description: Inhibition of PDE10A
In DepthDetails ArticlePubMed