BDBM50345448 3-(Isopropylthio)-8-oxo-8H-acenaphtho[1,2-b]pyrrole-9-carbonitrile::CHEMBL1784705
SMILES CC(C)Sc1ccc2c3c(C#N)c(=O)nc3c3cccc1c23
InChI Key InChIKey=VZDNSVLKUBJABZ-UHFFFAOYSA-N
Data  1 IC50
  Tab Delimited (TSV)   2D SDfile   Computed 3D by Vconf -m prep SDfile
Find this compound or compounds like it in BindingDB:
Activity Spreadsheet -- Enzyme Inhibition Constant Data from BindingDB
Found 1 hit for monomerid = 50345448
TargetFibroblast growth factor receptor 1(Homo sapiens (Human))
East China University Of Science And Technology
Curated by ChEMBL
LigandPNGBDBM50345448(3-(Isopropylthio)-8-oxo-8H-acenaphtho[1,2-b]pyrrol...)
Affinity DataIC50: >1.00E+4nM. Assay description: Inhibition of FGFR1 using poly(Glu-Tyr)4:1 as substrate after 60 mins by ELISA
In DepthDetails ArticlePubMed