BDBM50345455 CHEMBL1784727::Ethyl 3-(Allylthio)-8-oxo-8H-acenaphtho[1,2-b]pyrrole-9-carboxylate
SMILES CCOC(=O)c1c2c3ccc(SCC=C)c4cccc(c2nc1=O)c34
InChI Key InChIKey=VVFTZZHZIMAKEH-UHFFFAOYSA-N
Data  1 IC50
  Tab Delimited (TSV)   2D SDfile   Computed 3D by Vconf -m prep SDfile
Find this compound or compounds like it in BindingDB:
Activity Spreadsheet -- Enzyme Inhibition Constant Data from BindingDB
Found 1 hit for monomerid = 50345455
TargetFibroblast growth factor receptor 1(Homo sapiens (Human))
East China University Of Science And Technology
Curated by ChEMBL
LigandPNGBDBM50345455(CHEMBL1784727 | Ethyl 3-(Allylthio)-8-oxo-8H-acena...)
Affinity DataIC50:  485nM. Assay description: Inhibition of FGFR1 using poly(Glu-Tyr)4:1 as substrate after 60 mins by ELISA
In DepthDetails ArticlePubMed