BDBM50345457 CHEMBL1784729::Ethyl 8-Oxo-3-(2-(pyrazin-2-yl)ethylthio)-8H-acenaphtho[1,2-b]pyrrole-9-carboxylate
SMILES CCOC(=O)c1c2c3ccc(SCCc4cnccn4)c4cccc(c2nc1=O)c34
InChI Key InChIKey=XTUJRWNRJGZFHG-UHFFFAOYSA-N
Data  1 IC50
  Tab Delimited (TSV)   2D SDfile   Computed 3D by Vconf -m prep SDfile
Find this compound or compounds like it in BindingDB:
Activity Spreadsheet -- Enzyme Inhibition Constant Data from BindingDB
Found 1 hit for monomerid = 50345457
TargetFibroblast growth factor receptor 1(Homo sapiens (Human))
East China University Of Science And Technology
Curated by ChEMBL
LigandPNGBDBM50345457(CHEMBL1784729 | Ethyl 8-Oxo-3-(2-(pyrazin-2-yl)eth...)
Affinity DataIC50:  2.10E+3nM. Assay description: Inhibition of FGFR1 using poly(Glu-Tyr)4:1 as substrate after 60 mins by ELISA
In DepthDetails ArticlePubMed