BDBM50345469 2-Oxo-2-(2,2,3,3,3-pentafluoropropoxy)ethyl 8-Oxo-3-(propylthio)-8H-acenaphtho[1,2-b]pyrrole-9-carboxylate::CHEMBL1784741
SMILES CCCSc1ccc2c3c(C(=O)OCC(=O)OCC(F)(F)C(F)(F)F)c(=O)nc3c3cccc1c23
InChI Key InChIKey=JUHFRBMBESYUMH-UHFFFAOYSA-N
Data  1 IC50
  Tab Delimited (TSV)   2D SDfile   Computed 3D by Vconf -m prep SDfile
Find this compound or compounds like it in BindingDB:
Activity Spreadsheet -- Enzyme Inhibition Constant Data from BindingDB
Found 1 hit for monomerid = 50345469
TargetFibroblast growth factor receptor 1(Homo sapiens (Human))
East China University Of Science And Technology
Curated by ChEMBL
LigandPNGBDBM50345469(2-Oxo-2-(2,2,3,3,3-pentafluoropropoxy)ethyl 8-Oxo-...)
Affinity DataIC50: >1.00E+4nM. Assay description: Inhibition of FGFR1 using poly(Glu-Tyr)4:1 as substrate after 60 mins by ELISA
In DepthDetails ArticlePubMed