BDBM50346031 6-{4-Cyano-3-[(R)-2-hydroxy-3-(2-indan-2-yl-1,1-dimethyl-ethylamino)-propoxy]-phenyl}-tricyclo[3.2.1.0*2,4*]octane-3-carboxylic acid::CHEMBL1783764
SMILES CC(C)(CC1Cc2ccccc2C1)NC[C@@H](O)COc1cc(ccc1C#N)C1CC2CC1C1C2C1C(O)=O
InChI Key InChIKey=RBKBBMNRMOKHRT-HCIUYCJNSA-N
Data  1 IC50
  Tab Delimited (TSV)   2D SDfile   Computed 3D by Vconf -m prep SDfile
Find this compound or compounds like it in BindingDB:
Activity Spreadsheet -- Enzyme Inhibition Constant Data from BindingDB
Found 1 hit for monomerid = 50346031
TargetExtracellular calcium-sensing receptor(Homo sapiens (Human))
Pfizer
Curated by ChEMBL
LigandPNGBDBM50346031(6-{4-Cyano-3-[(R)-2-hydroxy-3-(2-indan-2-yl-1,1-di...)
Affinity DataIC50:  6nM. Assay description: Negative allosteric modulator activity at human recombinant calcium sensing receptor expressed in HEK cells
In DepthDetails ArticlePubMed