BDBM50346300 CHEMBL1782568::cis-((1S,3R)-1-isopropyl-3-((3S,4S)-3-methoxytetrahydro-2H-pyran-4-ylamino)cyclopentyl)(4-(6-(trifluoromethyl)pyrazin-2-yl)piperazin-1-yl)methanone
SMILES CO[C@@H]1COCC[C@@H]1N[C@@H]1CC[C@](C1)(C(C)C)C(=O)N1CCN(CC1)c1cncc(n1)C(F)(F)F
InChI Key InChIKey=CHFJPWYYMLQDHW-KCESLBEFSA-N
Data  3 IC50
  Tab Delimited (TSV)   2D SDfile   Computed 3D by Vconf -m prep SDfile
Find this compound or compounds like it in BindingDB:
Activity Spreadsheet -- Enzyme Inhibition Constant Data from BindingDB
Found 3 hits for monomerid = 50346300
TargetPotassium voltage-gated channel subfamily H member 2(Homo sapiens (Human))
Pfizer
Curated by ChEMBL
LigandPNGBDBM50346300(CHEMBL1782568 | cis-((1S,3R)-1-isopropyl-3-((3S,4S...)
Affinity DataIC50:  7.60E+3nM. Assay description: Displacement of labeled dofetilide from human ERG
In DepthDetails ArticlePubMed
TargetC-C chemokine receptor type 2(Homo sapiens (Human))
Pfizer
Curated by ChEMBL
LigandPNGBDBM50346300(CHEMBL1782568 | cis-((1S,3R)-1-isopropyl-3-((3S,4S...)
Affinity DataIC50:  43.7nM. Assay description: Antagonist activity at human CCR2 by whole blood assay
In DepthDetails ArticlePubMed
TargetC-C chemokine receptor type 2(Homo sapiens (Human))
Pfizer
Curated by ChEMBL
LigandPNGBDBM50346300(CHEMBL1782568 | cis-((1S,3R)-1-isopropyl-3-((3S,4S...)
Affinity DataIC50:  15.8nM. Assay description: Displacement of [125I]MCP1 from human CCR2 preincubated for 30 mins by human whole cell binding assay
In DepthDetails ArticlePubMed