BDBM50348103 CHEMBL1800427
SMILES NCc1sc2cc(ccc2c1Cl)C#Cc1ccccc1
InChI Key InChIKey=MSZUZTHRPIJQFZ-UHFFFAOYSA-N
Data  1 IC50
  Tab Delimited (TSV)   2D SDfile   Computed 3D by Vconf -m prep SDfile
Find this compound or compounds like it in BindingDB:
Activity Spreadsheet -- Enzyme Inhibition Constant Data from BindingDB
Found 1 hit for monomerid = 50348103
TargetAcid-sensing ion channel 3(Homo sapiens (Human))
Merck Research Laboratories
Curated by ChEMBL
LigandPNGBDBM50348103(CHEMBL1800427)
Affinity DataIC50:  2.80E+3nM. Assay description: Inhibition of ASIC3 assessed as inhibition of peak current by electrophysiology method
In DepthDetails ArticlePubMed